BDBM50241512 CHEMBL270332::c(Lys-Lys-Pro-Tyr-Ile-Leu-Lys-Lys-Pro-Tyr-Ile-Leu)
SMILES CC[C@H](C)[C@@H]1NC(=O)[C@H](Cc2ccc(O)cc2)NC(=O)[C@@H]2CCCN2C(=O)[C@H](CCCCN)NC(=O)[C@H](CCCCN)NC(=O)[C@H](CC(C)C)NC(=O)[C@@H](NC(=O)[C@H](Cc2ccc(O)cc2)NC(=O)[C@@H]2CCCN2C(=O)[C@H](CCCCN)NC(=O)[C@H](CCCCN)NC(=O)[C@H](CC(C)C)NC1=O)[C@@H](C)CC
InChI Key InChIKey=LUVWPAMEUQGOAT-CNPMHALYSA-N
Data  1 Kd
  Tab Delimited (TSV)   2D SDfile   Computed 3D by Vconf -m prep SDfile
Find this compound or compounds like it in BindingDB:
Activity Spreadsheet -- Enzyme Inhibition Constant Data from BindingDB
Found 1 hit for monomerid = 50241512
TargetNeurotensin receptor type 1(Homo sapiens (Human))
University Of Utah
Curated by ChEMBL
LigandPNGBDBM50241512(CHEMBL270332 | c(Lys-Lys-Pro-Tyr-Ile-Leu-Lys-Lys-P...)
Affinity DataKd:  150nM. Assay description: Binding affinity to human recombinant NTS1 in HEK293T cells by competitive binding assay
In DepthDetails ArticlePubMed