BDBM50241894 CHEMBL486197::gorgostane-3-beta,9-alpha,5-alpha,6-beta,11-alpha-tetrol
SMILES CC(C)[C@H](C)[C@@]1(C)C[C@@H]1[C@@H](C)[C@H]1CC[C@H]2[C@@H]3CC=C4C[C@@H](O)CC[C@]4(C)[C@@]3(O)[C@H](O)C[C@]12C
InChI Key InChIKey=OTTVISRUYFBLEW-MREQRLIMSA-N
Data  1 EC50
  Tab Delimited (TSV)   2D SDfile   Computed 3D by Vconf -m prep SDfile
Find this compound or compounds like it in BindingDB:
Activity Spreadsheet -- Enzyme Inhibition Constant Data from BindingDB
Found 1 hit for monomerid = 50241894
TargetOxysterols receptor LXR-alpha(Homo sapiens (Human))
Merck Research Laboratories
Curated by ChEMBL
LigandPNGBDBM50241894(CHEMBL486197 | gorgostane-3-beta,9-alpha,5-alpha,6...)
Affinity DataEC50:  450nM. Assay description: Agonist activity at human recombinant LXRalpha expressed in Escherichia coli BL21 cells assessed as association of recombinant SRC1 to LXRalpha ligan...
In DepthDetails ArticlePubMed