BDBM50242186 (+)-Makassaric acid::CHEMBL454582
SMILES CC1=CC[C@H]2[C@@](C)(CC[C@H]3C(C)(C)CCC[C@]23C)[C@@H]1Cc1cc(ccc1O)C(O)=O
InChI Key InChIKey=VIOMEESUKISOEL-XDEZJFBHSA-N
Data  1 IC50
  Tab Delimited (TSV)   2D SDfile   Computed 3D by Vconf -m prep SDfile
Find this compound or compounds like it in BindingDB:
Activity Spreadsheet -- Enzyme Inhibition Constant Data from BindingDB
Found 1 hit for monomerid = 50242186
TargetMAP kinase-activated protein kinase 2(Homo sapiens (Human))
University Of British Columbia
Curated by ChEMBL
LigandPNGBDBM50242186((+)-Makassaric acid | CHEMBL454582)
Affinity DataIC50:  2.00E+4nM. Assay description: Inhibition of MK2 (unknown origin)
In DepthDetails ArticlePubMed