BDBM50242835 4-(2-{[(2R)-2-(3-Fluorophenyl)-2-hydroxyethyl]amino}ethyl)-3-isopropoxy-1,1-biphenyl-4-carboxylic acid::CHEMBL516804
SMILES CC(C)Oc1cc(ccc1C(O)=O)-c1ccc(CCNC[C@H](O)c2cccc(F)c2)cc1
InChI Key InChIKey=AQZDSTWRVHDELC-DEOSSOPVSA-N
Data  2 EC50
  Tab Delimited (TSV)   2D SDfile   Computed 3D by Vconf -m prep SDfile
Find this compound or compounds like it in BindingDB:
Activity Spreadsheet -- Enzyme Inhibition Constant Data from BindingDB
Found 2 hits for monomerid = 50242835
TargetBeta-1 adrenergic receptor(Homo sapiens (Human))
Astellas Pharma
Curated by ChEMBL
LigandPNGBDBM50242835(4-(2-{[(2R)-2-(3-Fluorophenyl)-2-hydroxyethyl]amin...)
Affinity DataEC50:  320nM. Assay description: Agonist activity at human recombinant beta-1 adrenergic receptor expressed in CHO cells assessed as cAMP accumulation by enzyme immuno assay
In DepthDetails ArticlePubMed
TargetBeta-3 adrenergic receptor(Homo sapiens (Human))
Astellas Pharma
Curated by ChEMBL
LigandPNGBDBM50242835(4-(2-{[(2R)-2-(3-Fluorophenyl)-2-hydroxyethyl]amin...)
Affinity DataEC50:  2.10nM. Assay description: Agonist activity at human recombinant beta3 adrenergic receptor expressed in CHO cells assessed as cAMP accumulation by enzyme immuno assay
In DepthDetails ArticlePubMed