BDBM50244550 CHEMBL451135::rac-(E/Z)-(4-(4-fluorobenzylidene)-2-(hydroxymethyl)-5-oxo-tetrahydrofuran-2-yl)methyl pivalate
SMILES CC(C)(C)C(=O)OCC1(CO)C\C(=C\c2ccc(F)cc2)C(=O)O1
InChI Key InChIKey=DPLMTLZKPLCJAP-JYRVWZFOSA-N
Data  1 KI
  Tab Delimited (TSV)   2D SDfile   Computed 3D by Vconf -m prep SDfile
Find this compound or compounds like it in BindingDB:
Activity Spreadsheet -- Enzyme Inhibition Constant Data from BindingDB
Found 1 hit for monomerid = 50244550
TargetProtein kinase C alpha type(MOUSE)
National Cancer Institute-Frederick
Curated by ChEMBL
LigandPNGBDBM50244550(CHEMBL451135 | rac-(E/Z)-(4-(4-fluorobenzylidene)-...)
Affinity DataKi:  88.4nM. Assay description: Displacement of [3H]PDBu form mouse PKCalpha by scintillation counting
In DepthDetails ArticlePubMed