BDBM50244642 CHEMBL451800::rac-(E/Z)-(4-(4-(dimethylamino)benzylidene)-2-(hydroxymethyl)-5-oxo-tetrahydrofuran-2-yl)methyl benzoate
SMILES CN(C)c1ccc(\C=C2\CC(CO)(COC(=O)c3ccccc3)OC2=O)cc1
InChI Key InChIKey=DKVBAXOYYKRRBA-PDGQHHTCSA-N
Data  1 KI
  Tab Delimited (TSV)   2D SDfile   Computed 3D by Vconf -m prep SDfile
Find this compound or compounds like it in BindingDB:
Activity Spreadsheet -- Enzyme Inhibition Constant Data from BindingDB
Found 1 hit for monomerid = 50244642
TargetProtein kinase C alpha type(MOUSE)
National Cancer Institute-Frederick
Curated by ChEMBL
LigandPNGBDBM50244642(CHEMBL451800 | rac-(E/Z)-(4-(4-(dimethylamino)benz...)
Affinity DataKi:  654nM. Assay description: Displacement of [3H]PDBu form mouse PKCalpha by scintillation counting
In DepthDetails ArticlePubMed