BDBM50244867 CHEMBL472171::rac-(E)-{2-(Hydroxymethyl)-4-[(3-nitrophenyl)methylene]-5-oxo-2-2,3-dihydrofuryl}methyl 4-(dimethylamino)benzoate
SMILES CN(C)c1ccc(cc1)C(=O)OCC1(CO)C\C(=C/c2cccc(c2)[N+]([O-])=O)C(=O)O1
InChI Key InChIKey=XJIZSZWEOKQXGN-LICLKQGHSA-N
Data  2 KI
  Tab Delimited (TSV)   2D SDfile   Computed 3D by Vconf -m prep SDfile
Find this compound or compounds like it in BindingDB:
Activity Spreadsheet -- Enzyme Inhibition Constant Data from BindingDB
Found 2 hits for monomerid = 50244867
TargetRas guanyl-releasing protein 3(Homo sapiens (Human))
National Cancer Institute-Frederick
Curated by ChEMBL
LigandPNGBDBM50244867(CHEMBL472171 | rac-(E)-{2-(Hydroxymethyl)-4-[(3-ni...)
Affinity DataKi:  8nM. Assay description: Binding affinity to RasGRP3 (unknown origin)
In DepthDetails ArticlePubMed
TargetProtein kinase C alpha type(MOUSE)
National Cancer Institute-Frederick
Curated by ChEMBL
LigandPNGBDBM50244867(CHEMBL472171 | rac-(E)-{2-(Hydroxymethyl)-4-[(3-ni...)
Affinity DataKi:  72.4nM. Assay description: Displacement of [3H]PDBu form mouse PKCalpha by scintillation counting
In DepthDetails ArticlePubMed