BDBM50245159 2-(piperidin-1-yl)-8-(5-(thiophen-3-yl)thiazol-2-yl)-4H-chromen-4-one::CHEMBL508976
SMILES O=c1cc(oc2c(cccc12)-c1ncc(s1)-c1ccsc1)N1CCCCC1
InChI Key InChIKey=IEBMTNQFGWOOAA-UHFFFAOYSA-N
Data  1 IC50
  Tab Delimited (TSV)   2D SDfile   Computed 3D by Vconf -m prep SDfile
Find this compound or compounds like it in BindingDB:
Activity Spreadsheet -- Enzyme Inhibition Constant Data from BindingDB
Found 1 hit for monomerid = 50245159
TargetDNA-dependent protein kinase catalytic subunit(Homo sapiens (Human))
Newcastle University
Curated by ChEMBL
LigandPNGBDBM50245159(2-(piperidin-1-yl)-8-(5-(thiophen-3-yl)thiazol-2-y...)
Affinity DataIC50:  240nM. Assay description: Inhibition of DNA-dependent protein kinase
In DepthDetails ArticlePubMed