BDBM50247083 (R,5Z,8Z,11Z,14Z)-N-(1-hydroxypropan-2-yl)-19-phenylnonadeca-5,8,11,14-tetraenamide::CHEMBL460307
SMILES C[C@H](CO)NC(=O)CCC\C=C/C\C=C/C\C=C/C\C=C/CCCCc1ccccc1
InChI Key InChIKey=BFHZIJQQMQWEIY-VQMWNABPSA-N
Data  2 KI
  Tab Delimited (TSV)   2D SDfile   Computed 3D by Vconf -m prep SDfile
Find this compound or compounds like it in BindingDB:
Activity Spreadsheet -- Enzyme Inhibition Constant Data from BindingDB
Found 1 hit for monomerid = 50247083
TargetCannabinoid receptor 1(Rattus norvegicus (rat))
Northeastern University
Curated by ChEMBL
LigandPNGBDBM50247083((R,5Z,8Z,11Z,14Z)-N-(1-hydroxypropan-2-yl)-19-phen...)
Affinity DataKi:  13.3nM. Assay description: Displacement of [3H]CP55940 from cannabinoid CB1 receptor in rat brain membrane in presence of phenylmethanesulfonyl fluoride
In DepthDetails ArticlePubMed