BDBM50247523 CHEMBL473732::methyl 2-((2S,4S)-4-(3,4,5-trimethoxybenzamido)-1-acetylpyrrolidine-2-carboxamido)acetate
SMILES COC(=O)CNC(=O)[C@@H]1C[C@@H](CN1C(C)=O)NC(=O)c1cc(OC)c(OC)c(OC)c1
InChI Key InChIKey=VOISKJXADUZZFZ-KBPBESRZSA-N
Data  2 IC50
  Tab Delimited (TSV)   2D SDfile   Computed 3D by Vconf -m prep SDfile
Find this compound or compounds like it in BindingDB:
Activity Spreadsheet -- Enzyme Inhibition Constant Data from BindingDB
Found 2 hits for monomerid = 50247523
TargetAminopeptidase N(Homo sapiens (Human))
Shandong University
Curated by ChEMBL
LigandPNGBDBM50247523(CHEMBL473732 | methyl 2-((2S,4S)-4-(3,4,5-trimetho...)
Affinity DataIC50:  1.22E+5nM. Assay description: Inhibition of aminopeptidase N (unknown origin) by microtiter plate fluorimetric assay
In DepthDetails ArticlePubMed
Target72 kDa type IV collagenase(Homo sapiens (Human))
Shandong University
Curated by ChEMBL
LigandPNGBDBM50247523(CHEMBL473732 | methyl 2-((2S,4S)-4-(3,4,5-trimetho...)
Affinity DataIC50:  109nM. Assay description: Inhibition of MMP2 (unknown origin) by microtiter plate fluorimetric assay
In DepthDetails ArticlePubMed