BDBM50247808 3-Nitro-1-(beta-D-ribofuranosyl)imidazole 5'-phosphate::CHEMBL538119
SMILES O[C@H]1[C@@H](O)[C@@H](O[C@@H]1COP([O-])([O-])=O)n1cnc(c1)[N+]([O-])=O
InChI Key InChIKey=XMHFVPLENCGVAN-XVFCMESISA-L
Data  1 KI
  Tab Delimited (TSV)   2D SDfile   Computed 3D by Vconf -m prep SDfile
Find this compound or compounds like it in BindingDB:
Activity Spreadsheet -- Enzyme Inhibition Constant Data from BindingDB
Found 1 hit for monomerid = 50247808
TargetMultifunctional protein ADE2(Gallus gallus)
Wayne State University
Curated by ChEMBL
LigandPNGBDBM50247808(3-Nitro-1-(beta-D-ribofuranosyl)imidazole 5'-phosp...)
Affinity DataKi:  1.30E+3nM. Assay description: Inhibition of Gallus gallus AIR carboxylase by CAIR decarboxylation assay
In DepthDetails ArticlePubMed