BDBM50247886 Azlin::Azlocillin Sodium::CHEBI:51864::Securopen
SMILES [Na+].[H][C@]12SC(C)(C)[C@@H](N1C(=O)[C@H]2NC(=O)[C@H](NC(=O)N1CCNC1=O)c1ccccc1)C([O-])=O
InChI Key InChIKey=UVOCNBWUHNCKJM-XFAPPKAWSA-M
Data  4 IC50
  Tab Delimited (TSV)   2D SDfile   Computed 3D by Vconf -m prep SDfile
Find this compound or compounds like it in BindingDB:
Activity Spreadsheet -- Enzyme Inhibition Constant Data from BindingDB
Found 4 hits for monomerid = 50247886
TargetATP-binding cassette sub-family C member 4(Homo sapiens (Human))
Amgen
Curated by ChEMBL
LigandPNGBDBM50247886(Azlin | Azlocillin Sodium | CHEBI:51864 | Securope...)
Affinity DataIC50: >1.33E+5nM. Assay description: Inhibition of human MRP4 overexpressed in Sf9 cell membrane vesicles assessed as uptake of [3H]-estradiol-17beta-D-glucuronide in presence of ATP and...
In DepthDetails ArticlePubMed
TargetATP-binding cassette sub-family C member 3(Homo sapiens (Human))
Amgen
Curated by ChEMBL
LigandPNGBDBM50247886(Azlin | Azlocillin Sodium | CHEBI:51864 | Securope...)
Affinity DataIC50: >1.33E+5nM. Assay description: Inhibition of human MRP3 overexpressed in Sf9 insect cell membrane vesicles assessed as uptake of [3H]-estradiol-17beta-D-glucuronide in presence of ...
In DepthDetails ArticlePubMed
TargetBile salt export pump(Homo sapiens (Human))
Amgen
Curated by ChEMBL
LigandPNGBDBM50247886(Azlin | Azlocillin Sodium | CHEBI:51864 | Securope...)
Affinity DataIC50: >1.33E+5nM. Assay description: Inhibition of human BSEP overexpressed in Sf9 cell membrane vesicles assessed as uptake of [3H]-taurocholate in presence of ATP measured after 15 to ...
In DepthDetails ArticlePubMed
TargetATP-binding cassette sub-family C member 2(Homo sapiens (Human))
Amgen
Curated by ChEMBL
LigandPNGBDBM50247886(Azlin | Azlocillin Sodium | CHEBI:51864 | Securope...)
Affinity DataIC50: >1.33E+5nM. Assay description: Inhibition of human MRP2 overexpressed in Sf9 cell membrane vesicles assessed as uptake of [3H]-estradiol-17beta-D-glucuronide in presence of ATP and...
In DepthDetails ArticlePubMed