BDBM50249290 CHEMBL474419::methyl 4-((4-(4-(thiazol-2-yl)pyrimidin-2-ylamino)phenoxy)methyl)benzoate
SMILES COC(=O)c1ccc(COc2ccc(Nc3nccc(n3)-c3nccs3)cc2)cc1
InChI Key InChIKey=VBYMJVIYBKLGQT-UHFFFAOYSA-N
Data  1 IC50
  Tab Delimited (TSV)   2D SDfile   Computed 3D by Vconf -m prep SDfile
Find this compound or compounds like it in BindingDB:
Activity Spreadsheet -- Enzyme Inhibition Constant Data from BindingDB
Found 1 hit for monomerid = 50249290
TargetTyrosine-protein kinase SYK(Homo sapiens (Human))
Sichuan University
Curated by ChEMBL
LigandPNGBDBM50249290(CHEMBL474419 | methyl 4-((4-(4-(thiazol-2-yl)pyrim...)
Affinity DataIC50:  2.00E+3nM. Assay description: Inhibition of recombinant Syk (unknown origin)
In DepthDetails ArticlePubMed