BDBM50250994 CHEMBL448796::mallotinic acid
SMILES O[C@@H]1[C@H]2COC(=O)c3cc(O)c(O)c(O)c3-c3c(O)c(O)c(Oc4c(O)c(O)c(O)cc4C(O)=O)cc3C(=O)O[C@@H]1[C@@H](O)[C@H](OC(=O)c1cc(O)c(O)c(O)c1)O2
InChI Key InChIKey=AJIFASHLGBHDDS-GEFDNOIESA-N
Data  1 IC50
  Tab Delimited (TSV)   2D SDfile   Computed 3D by Vconf -m prep SDfile
Find this compound or compounds like it in BindingDB:
Activity Spreadsheet -- Enzyme Inhibition Constant Data from BindingDB
Found 1 hit for monomerid = 50250994
TargetSqualene monooxygenase(Rattus norvegicus)
University Of Shizuoka
Curated by ChEMBL
LigandPNGBDBM50250994(CHEMBL448796 | mallotinic acid)
Affinity DataIC50:  8.00E+3nM. Assay description: Inhibition of C-terminal hexahistidine-tagged rat recombinant squalene epoxidase without N-terminal putative membrane domain expressed in Escherichia...
In DepthDetails ArticlePubMed