BDBM50251446 4-((methyl(3-(methyl(2-oxo-2-(4-phenoxyphenylamino)ethyl)amino)propyl)amino)methyl)benzoic acid::CHEMBL481674
SMILES CN(CCCN(C)Cc1ccc(cc1)C(O)=O)CC(=O)Nc1ccc(Oc2ccccc2)cc1
InChI Key InChIKey=GBAHLBKZCVVWKG-UHFFFAOYSA-N
Data  3 IC50
  Tab Delimited (TSV)   2D SDfile   Computed 3D by Vconf -m prep SDfile
Find this compound or compounds like it in BindingDB:
Activity Spreadsheet -- Enzyme Inhibition Constant Data from BindingDB
Found 3 hits for monomerid = 50251446
TargetLeukotriene A-4 hydrolase(Homo sapiens (Human))
Berlex Biosciences
Curated by ChEMBL
LigandPNGBDBM50251446(4-((methyl(3-(methyl(2-oxo-2-(4-phenoxyphenylamino...)
Affinity DataIC50:  6nM. Assay description: Inhibition of LTA4 hydrolase (unknown origin) by hydrolase assay
In DepthDetails ArticlePubMed
TargetLeukotriene A-4 hydrolase(Homo sapiens (Human))
Berlex Biosciences
Curated by ChEMBL
LigandPNGBDBM50251446(4-((methyl(3-(methyl(2-oxo-2-(4-phenoxyphenylamino...)
Affinity DataIC50:  6nM. Assay description: Inhibition of human leukotriene A4 hydrolase
In DepthDetails ArticlePubMed
TargetLeukotriene A-4 hydrolase(Homo sapiens (Human))
Berlex Biosciences
Curated by ChEMBL
LigandPNGBDBM50251446(4-((methyl(3-(methyl(2-oxo-2-(4-phenoxyphenylamino...)
Affinity DataIC50:  120nM. Assay description: Inhibition of LTA4 hydrolase (unknown origin) by whole blood assay
In DepthDetails ArticlePubMed