BDBM50252783 CHEMBL493672::Isosorbide-2-benzylcarbamate-5-propionate
SMILES CCC(=O)O[C@@H]1CO[C@@H]2[C@H](CO[C@H]12)OC(=O)NCc1ccccc1
InChI Key InChIKey=FDUDHTXZERVRTN-OCVGTWLNSA-N
Data  1 IC50
  Tab Delimited (TSV)   2D SDfile   Computed 3D by Vconf -m prep SDfile
Find this compound or compounds like it in BindingDB:
Activity Spreadsheet -- Enzyme Inhibition Constant Data from BindingDB
Found 1 hit for monomerid = 50252783
TargetCholinesterase(Homo sapiens (Human))
Trinity College
Curated by ChEMBL
LigandPNGBDBM50252783(CHEMBL493672 | Isosorbide-2-benzylcarbamate-5-prop...)
Affinity DataIC50:  980nM. Assay description: Inhibition of human plasma BuchE by Ellman's method
In DepthDetails ArticlePubMed