BDBM50253352 (+/-)-Ethyl-[2-hydroxy-2-[2-methyl-5-(4-methylsulfonyl)-phenyl-1-phenyl-1H-pyrrol-3-yl]]acetate::CHEMBL523720
SMILES CCOC(=O)C(O)c1cc(-c2ccc(cc2)S(C)(=O)=O)n(c1C)-c1ccccc1
InChI Key InChIKey=DSEATYLBKDNYNP-UHFFFAOYSA-N
Data  2 IC50
  Tab Delimited (TSV)   2D SDfile   Computed 3D by Vconf -m prep SDfile
Find this compound or compounds like it in BindingDB:
Activity Spreadsheet -- Enzyme Inhibition Constant Data from BindingDB
Found 2 hits for monomerid = 50253352
TargetProstaglandin G/H synthase 2(Mus musculus (Mouse))
Sapienza University Of Rome
Curated by ChEMBL
LigandPNGBDBM50253352((+/-)-Ethyl-[2-hydroxy-2-[2-methyl-5-(4-methylsulf...)
Affinity DataIC50:  300nM. Assay description: Inhibition of COX2 in LPS-stimulated mouse J774 cells assessed as inhibition of PGE2 production after 15 mins by radioimmunoassay
In DepthDetails ArticlePubMed
TargetProstaglandin G/H synthase 1(Mus musculus)
Sapienza University Of Rome
Curated by ChEMBL
LigandPNGBDBM50253352((+/-)-Ethyl-[2-hydroxy-2-[2-methyl-5-(4-methylsulf...)
Affinity DataIC50: >1.00E+5nM. Assay description: Inhibition of COX1 in arachidonic acid-stimulated mouse J774 cells assessed as inhibition of PGE2 production after 15 mins by radioimmunoassay
In DepthDetails ArticlePubMed