BDBM50253487 (+)-(S)-Ethyl-[2-hydroxy-2-[2-methyl-5-(4-methylsulfonyl)phenyl-1-phenyl-1H-pyrrol-3-yl]]acetate::CHEMBL494700
SMILES CCOC(=O)[C@@H](O)c1cc(-c2ccc(cc2)S(C)(=O)=O)n(c1C)-c1ccccc1
InChI Key InChIKey=DSEATYLBKDNYNP-NRFANRHFSA-N
Data  2 IC50
  Tab Delimited (TSV)   2D SDfile   Computed 3D by Vconf -m prep SDfile
Find this compound or compounds like it in BindingDB:
Activity Spreadsheet -- Enzyme Inhibition Constant Data from BindingDB
Found 2 hits for monomerid = 50253487
TargetProstaglandin G/H synthase 2(Mus musculus (Mouse))
Sapienza University Of Rome
Curated by ChEMBL
LigandPNGBDBM50253487((+)-(S)-Ethyl-[2-hydroxy-2-[2-methyl-5-(4-methylsu...)
Affinity DataIC50:  180nM. Assay description: Inhibition of COX2 in LPS-stimulated mouse J774 cells assessed as inhibition of PGE2 production after 15 mins by radioimmunoassay
In DepthDetails ArticlePubMed
TargetProstaglandin G/H synthase 1(Mus musculus)
Sapienza University Of Rome
Curated by ChEMBL
LigandPNGBDBM50253487((+)-(S)-Ethyl-[2-hydroxy-2-[2-methyl-5-(4-methylsu...)
Affinity DataIC50: >1.00E+5nM. Assay description: Inhibition of COX1 in arachidonic acid-stimulated mouse J774 cells assessed as inhibition of PGE2 production after 15 mins by radioimmunoassay
In DepthDetails ArticlePubMed