BDBM50253489 (+/-)-Ethyl-[2-hydroxy-2-[1-(3-fluoro)phenyl-2-methyl-5-(4-methylsulfonyl)phenyl-1H-pyrrol-3-yl]]acetate::CHEMBL494905
SMILES CCOC(=O)C(O)c1cc(-c2ccc(cc2)S(C)(=O)=O)n(c1C)-c1cccc(F)c1
InChI Key InChIKey=QMMAGKWGLWQMID-UHFFFAOYSA-N
Data  4 IC50
  Tab Delimited (TSV)   2D SDfile   Computed 3D by Vconf -m prep SDfile
Find this compound or compounds like it in BindingDB:
Activity Spreadsheet -- Enzyme Inhibition Constant Data from BindingDB
Found 4 hits for monomerid = 50253489
TargetProstaglandin G/H synthase 1(Homo sapiens (Human))
Sapienza University Of Rome
Curated by ChEMBL
LigandPNGBDBM50253489((+/-)-Ethyl-[2-hydroxy-2-[1-(3-fluoro)phenyl-2-met...)
Affinity DataIC50:  2.13E+4nM. Assay description: Inhibition of COX1 in human whole blood assessed as inhibition of LPS-stimulated PGE2 production by radioimmunoassay
In DepthDetails ArticlePubMed
TargetProstaglandin G/H synthase 2(Homo sapiens (Human))
Sapienza University Of Rome
Curated by ChEMBL
LigandPNGBDBM50253489((+/-)-Ethyl-[2-hydroxy-2-[1-(3-fluoro)phenyl-2-met...)
Affinity DataIC50:  3.80E+3nM. Assay description: Inhibition of COX2 in human whole blood assessed as inhibition of TXB2 production by radioimmunoassay
In DepthDetails ArticlePubMed
TargetProstaglandin G/H synthase 2(Mus musculus (Mouse))
Sapienza University Of Rome
Curated by ChEMBL
LigandPNGBDBM50253489((+/-)-Ethyl-[2-hydroxy-2-[1-(3-fluoro)phenyl-2-met...)
Affinity DataIC50:  120nM. Assay description: Inhibition of COX2 in LPS-stimulated mouse J774 cells assessed as inhibition of PGE2 production after 15 mins by radioimmunoassay
In DepthDetails ArticlePubMed
TargetProstaglandin G/H synthase 1(Mus musculus)
Sapienza University Of Rome
Curated by ChEMBL
LigandPNGBDBM50253489((+/-)-Ethyl-[2-hydroxy-2-[1-(3-fluoro)phenyl-2-met...)
Affinity DataIC50: >1.00E+5nM. Assay description: Inhibition of COX1 in arachidonic acid-stimulated mouse J774 cells assessed as inhibition of PGE2 production after 15 mins by radioimmunoassay
In DepthDetails ArticlePubMed