BDBM50253711 CHEMBL449460::Phenyl-[4-(1-imidazol-1-yl-ethyl)-phenyl]-amine
SMILES CC(c1ccc(Nc2ccccc2)cc1)n1ccnc1
InChI Key InChIKey=UKUZQWGBVJLTAU-UHFFFAOYSA-N
Data  1 IC50
  Tab Delimited (TSV)   2D SDfile   Computed 3D by Vconf -m prep SDfile
Find this compound or compounds like it in BindingDB:
Activity Spreadsheet -- Enzyme Inhibition Constant Data from BindingDB
Found 1 hit for monomerid = 50253711
TargetCytochrome P450 26A1(Homo sapiens (Human))
Cardiff University
Curated by ChEMBL
LigandPNGBDBM50253711(CHEMBL449460 | Phenyl-[4-(1-imidazol-1-yl-ethyl)-p...)
Affinity DataIC50:  3.50E+4nM. Assay description: Inhibition of CYP26A1 in human MCF7 cells
In DepthDetails ArticlePubMed