BDBM50128056 (E)-N-allyl-4-(3-(4-bromophenyl)benzofuran-6-yloxy)-N-methylbut-2-en-1-aminium::ALLYL-{4-[3-(4-BROMO-PHENYL)-BENZOFURAN-6-YLOXY]-BUT-2-ENYL}-METHYL-AMINE::CHEMBL481811::CHEMBL65553::N-allyl-4-(3-(4-bromophenyl)benzofuran-6-yloxy)-N-methylbut-2-en-1-aminium
SMILES CN(CC=C)C\C=C\COc1ccc2c(coc2c1)-c1ccc(Br)cc1
InChI Key InChIKey=KCNKJCHARANTIP-SNAWJCMRSA-N
Data  7 IC50
PDB links: 1 PDB ID matches this monomer.
  Tab Delimited (TSV)   2D SDfile   Computed 3D by Vconf -m prep SDfile
Find this compound or compounds like it in BindingDB:
Activity Spreadsheet -- Enzyme Inhibition Constant Data from BindingDB
Found 7 hits for monomerid = 50128056
TargetLanosterol synthase(Homo sapiens (Human))
Albert-Ludwigs-University Of Freiburg
Curated by ChEMBL
LigandPNGBDBM50128056((E)-N-allyl-4-(3-(4-bromophenyl)benzofuran-6-yloxy...)
Affinity DataIC50:  500nM. Assay description: Inhibitory activity against Oxidosqualene-lanosterol cyclase from human liver microsomes
In DepthDetails ArticlePubMed
TargetSqualene--hopene cyclase(Alicyclobacillus acidocaldarius)
Albert-Ludwigs-University Of Freiburg
Curated by ChEMBL
LigandPNGBDBM50128056((E)-N-allyl-4-(3-(4-bromophenyl)benzofuran-6-yloxy...)
Affinity DataIC50:  23nM. Assay description: Inhibitory activity against squalene hopene cyclase from Alicyclobacillus acidocaldarius
TargetLanosterol synthase ERG7(Saccharomyces cerevisiae)
Università
Curated by ChEMBL
LigandPNGBDBM50128056((E)-N-allyl-4-(3-(4-bromophenyl)benzofuran-6-yloxy...)
Affinity DataIC50:  210nM. Assay description: Inhibition of yeast OSC expressed in Saccharomyces cerevisiae SMY8
In DepthDetails ArticlePubMed
TargetLanosterol synthase(Homo sapiens (Human))
Albert-Ludwigs-University Of Freiburg
Curated by ChEMBL
LigandPNGBDBM50128056((E)-N-allyl-4-(3-(4-bromophenyl)benzofuran-6-yloxy...)
Affinity DataIC50:  501nM. Assay description: Inhibition of oxidosqualene cyclase
In DepthDetails ArticlePubMed
TargetLanosterol synthase(Homo sapiens (Human))
Albert-Ludwigs-University Of Freiburg
Curated by ChEMBL
LigandPNGBDBM50128056((E)-N-allyl-4-(3-(4-bromophenyl)benzofuran-6-yloxy...)
Affinity DataIC50:  9.00E+4nM. Assay description: Inhibition of human OSC expressed in Saccharomyces cerevisiae SMY8
In DepthDetails ArticlePubMed
TargetLanosterol synthase(Homo sapiens (Human))
Albert-Ludwigs-University Of Freiburg
Curated by ChEMBL
LigandPNGBDBM50128056((E)-N-allyl-4-(3-(4-bromophenyl)benzofuran-6-yloxy...)
Affinity DataIC50:  501nM. Assay description: Inhibition of oxidosqualene cyclase
In DepthDetails ArticlePubMed
TargetCycloartenol synthase(Arabidopsis thaliana)
Università
Curated by ChEMBL
LigandPNGBDBM50128056((E)-N-allyl-4-(3-(4-bromophenyl)benzofuran-6-yloxy...)
Affinity DataIC50:  3.00E+3nM. Assay description: Inhibition of Arabidopsis thaliana cycloartenol synthase expressed in Saccharomyces cerevisiae SMY8
In DepthDetails ArticlePubMed