BDBM50257026 4-(cyclopentylamino)-2-phenylpyrido[2,3-e][1,2,4]triazolo[4,3-a]pyrazin-1(2H)-one::CHEMBL473649
SMILES O=c1n(nc2c(NC3CCCC3)nc3ncccc3n12)-c1ccccc1
InChI Key InChIKey=NWDKFYOWSMUWPD-UHFFFAOYSA-N
Data  3 KI
  Tab Delimited (TSV)   2D SDfile   Computed 3D by Vconf -m prep SDfile
Find this compound or compounds like it in BindingDB:
Activity Spreadsheet -- Enzyme Inhibition Constant Data from BindingDB
Found 3 hits for monomerid = 50257026
TargetAdenosine receptor A1(BOVINE)
Universita Di Firenze
Curated by ChEMBL
LigandPNGBDBM50257026(4-(cyclopentylamino)-2-phenylpyrido[2,3-e][1,2,4]t...)
Affinity DataKi:  0.470nM. Assay description: Displacement of [3H]DPCPX from bovine brain cortical membrane adenosine A1 receptor
In DepthDetails ArticlePubMed
TargetAdenosine receptor A3(Homo sapiens (Human))
Universita Di Firenze
Curated by ChEMBL
LigandPNGBDBM50257026(4-(cyclopentylamino)-2-phenylpyrido[2,3-e][1,2,4]t...)
Affinity DataKi:  8.40nM. Assay description: Displacement of [125I]AB-MECA from human cloned adenosine A3 receptor expressed in CHO cells
In DepthDetails ArticlePubMed
TargetAdenosine receptor A2a(Homo sapiens (Human))
Universita Di Firenze
Curated by ChEMBL
LigandPNGBDBM50257026(4-(cyclopentylamino)-2-phenylpyrido[2,3-e][1,2,4]t...)
Affinity DataKi:  208nM. Assay description: Displacement of [3H]NECA from human cloned adenosine A2A receptor expressed in CHO cells
In DepthDetails ArticlePubMed