BDBM50259412 CHEMBL4080844
SMILES CC[C@@H](CO)Nc1ccc2ncc(\C=C\c3cccc(c3)C(F)(F)F)n2n1
InChI Key InChIKey=GWGKDCYRVAQDDJ-LFAOLKIESA-N
Data  11 IC50
  Tab Delimited (TSV)   2D SDfile   Computed 3D by Vconf -m prep SDfile
Find this compound or compounds like it in BindingDB:
Activity Spreadsheet -- Enzyme Inhibition Constant Data from BindingDB
Found 11 hits for monomerid = 50259412
TargetDual specificity protein kinase CLK3(Mus musculus)
University of Paris
Curated by ChEMBL
LigandPNGBDBM50259412(CHEMBL4080844)
Affinity DataIC50: >1.00E+4nM. Assay description: Inhibition of GST tagged recombinant mouse CLK3 expressed in Escherichia coli using RS peptide as substrate after 30 mins by [gamma-33P]ATP based sci...
In DepthDetails ArticlePubMed
TargetDual specificity protein kinase CLK2(Mus musculus)
University of Paris
Curated by ChEMBL
LigandPNGBDBM50259412(CHEMBL4080844)
Affinity DataIC50:  9.10E+3nM. Assay description: Inhibitory concentration against dipeptidyl peptidase IV
In DepthDetails ArticlePubMed
TargetDual specificity tyrosine-phosphorylation-regulated kinase 1A(Homo sapiens (Human))
University of Paris
Curated by ChEMBL
LigandPNGBDBM50259412(CHEMBL4080844)
Affinity DataIC50: >1.00E+4nM. Assay description: Inhibition of GST tagged recombinant human DYRK1A expressed in Escherichia coli using woodtide as substrate after 30 mins by [gamma-33P]ATP based sci...
In DepthDetails ArticlePubMed
TargetDual specificity protein kinase CLK4(Mus musculus)
University of Paris
Curated by ChEMBL
LigandPNGBDBM50259412(CHEMBL4080844)
Affinity DataIC50:  410nM. Assay description: Inhibition of GST tagged recombinant mouse CLK4 expressed in Escherichia coli using RS peptide as substrate after 30 mins by [gamma-33P]ATP based sci...
In DepthDetails ArticlePubMed
TargetDual specificity protein kinase CLK1(Mus musculus)
University of Paris
Curated by ChEMBL
LigandPNGBDBM50259412(CHEMBL4080844)
Affinity DataIC50:  790nM. Assay description: In vitro inhibition of [3H]DAMGO binding to Opioid receptor mu
In DepthDetails ArticlePubMed
TargetCyclin-T1/Cyclin-dependent kinase 9(Homo sapiens (Human))
University of Paris
Curated by ChEMBL
LigandPNGBDBM50259412(CHEMBL4080844)
Affinity DataIC50:  3.70E+3nM. Assay description: Inhibition of human recombinant CDK2/cyclin A after 30 mins by [gamma-33P]ATP based scintillation counting analysis
In DepthDetails ArticlePubMed
TargetDual specificity tyrosine-phosphorylation-regulated kinase 2(Homo sapiens (Human))
University of Paris
Curated by ChEMBL
LigandPNGBDBM50259412(CHEMBL4080844)
Affinity DataIC50: >1.00E+4nM. Assay description: Inhibition of GST tagged recombinant human DYRK2 expressed in Escherichia coli using using woodtide as substrate after 30 mins by [gamma-33P]ATP base...
In DepthDetails ArticlePubMed
TargetDual specificity tyrosine-phosphorylation-regulated kinase 3(Homo sapiens (Human))
University of Paris
Curated by ChEMBL
LigandPNGBDBM50259412(CHEMBL4080844)
Affinity DataIC50: >1.00E+4nM. Assay description: Inhibition of GST tagged recombinant human DYRK3 expressed in Escherichia coli using woodtide as substrate after 30 mins by [gamma-33P]ATP based scin...
In DepthDetails ArticlePubMed
TargetCyclin-A2/Cyclin-dependent kinase 2(Homo sapiens (Human))
University of Paris
Curated by ChEMBL
LigandPNGBDBM50259412(CHEMBL4080844)
Affinity DataIC50: >1.00E+4nM. Assay description: Inhibition of human recombinant CDK9/cyclin T expressed in insect cells using CDK7/9-tide as substrate after 30 mins by [gamma-33P]ATP based scintill...
In DepthDetails ArticlePubMed
TargetCyclin-dependent kinase 5 activator 1(Homo sapiens (Human))
University of Paris
Curated by ChEMBL
LigandPNGBDBM50259412(CHEMBL4080844)
Affinity DataIC50: >1.00E+4nM. Assay description: Inhibition of human recombinant CDK5/p25 after 30 mins by [gamma-33P]ATP based scintillation counting analysis
In DepthDetails ArticlePubMed
TargetDual specificity tyrosine-phosphorylation-regulated kinase 1B(Homo sapiens (Human))
University of Paris
Curated by ChEMBL
LigandPNGBDBM50259412(CHEMBL4080844)
Affinity DataIC50: >1.00E+4nM. Assay description: Inhibition of GST tagged recombinant human DYRK1B expressed in Escherichia coli using woodtide as substrate after 30 mins by [gamma-33P]ATP based sci...
In DepthDetails ArticlePubMed