BDBM50262326 2-Amino-6-phenyl-4-(3-trifluoromethoxy-phenyl)-nicotinonitrile::CHEMBL469004
SMILES Nc1nc(cc(-c2cccc(OC(F)(F)F)c2)c1C#N)-c1ccccc1
InChI Key InChIKey=IVNSNCNXTPPQFV-UHFFFAOYSA-N
Data  2 KI
  Tab Delimited (TSV)   2D SDfile   Computed 3D by Vconf -m prep SDfile
Find this compound or compounds like it in BindingDB:
Activity Spreadsheet -- Enzyme Inhibition Constant Data from BindingDB
Found 2 hits for monomerid = 50262326
TargetAdenosine receptor A1(Homo sapiens (Human))
Leiden/Amsterdam Center For Drug Research
Curated by ChEMBL
LigandPNGBDBM50262326(2-Amino-6-phenyl-4-(3-trifluoromethoxy-phenyl)-nic...)
Affinity DataKi:  34nM. Assay description: Displacement of [3H]DPCPX from human adenosine A1 receptor expressed in CHO cell membrane
In DepthDetails ArticlePubMed
TargetAdenosine receptor A2a(Homo sapiens (Human))
Leiden/Amsterdam Center For Drug Research
Curated by ChEMBL
LigandPNGBDBM50262326(2-Amino-6-phenyl-4-(3-trifluoromethoxy-phenyl)-nic...)
Affinity DataKi:  58nM. Assay description: Displacement of [3H]ZM241385 from human adenosine A2A receptor expressed in HEK293 cell membrane
In DepthDetails ArticlePubMed