BDBM50263445 CHEMBL476137::ethyl 2-cyano-2-(3-ethyl-5-((2-fluorophenylamino)methylene)-4-oxothiazolidin-2-ylidene)acetate
SMILES CCOC(=O)C(\C#N)=c1/s\c(=C\Nc2ccccc2F)c(=O)n1CC
InChI Key InChIKey=IAQKTFXXNGYFFJ-DECHVDIESA-N
Data  1 IC50
  Tab Delimited (TSV)   2D SDfile   Computed 3D by Vconf -m prep SDfile
Find this compound or compounds like it in BindingDB:
Activity Spreadsheet -- Enzyme Inhibition Constant Data from BindingDB
Found 1 hit for monomerid = 50263445
TargetSerine/threonine-protein kinase PLK1(Homo sapiens (Human))
Sichuan University
Curated by ChEMBL
LigandPNGBDBM50263445(CHEMBL476137 | ethyl 2-cyano-2-(3-ethyl-5-((2-fluo...)
Affinity DataIC50:  160nM. Assay description: Inhibition of PLK1 (unknown origin)
In DepthDetails ArticlePubMed