BDBM50264587 (R)-5-(3-(2-(2-(3-chlorophenyl)-2-hydroxyethylamino)ethyl)phenoxy)-2-(2-oxopyrrolidin-1-yl)benzoic acid::CHEMBL482627
SMILES O[C@@H](CNCCc1cccc(Oc2ccc(N3CCCC3=O)c(c2)C(O)=O)c1)c1cccc(Cl)c1
InChI Key InChIKey=JQIVPXQYQMWJIR-VWLOTQADSA-N
Data  3 EC50
  Tab Delimited (TSV)   2D SDfile   Computed 3D by Vconf -m prep SDfile
Find this compound or compounds like it in BindingDB:
Activity Spreadsheet -- Enzyme Inhibition Constant Data from BindingDB
Found 3 hits for monomerid = 50264587
TargetBeta-3 adrenergic receptor(Canis familiaris)
Astellas Pharma
Curated by ChEMBL
LigandPNGBDBM50264587((R)-5-(3-(2-(2-(3-chlorophenyl)-2-hydroxyethylamin...)
Affinity DataEC50:  1.90nM. Assay description: Agonist activity at dog cloned adrenergic beta3 receptor expressed in CHO cells assessed as cAMP accumulation
In DepthDetails ArticlePubMed
TargetBeta-1 adrenergic receptor(Homo sapiens (Human))
Astellas Pharma
Curated by ChEMBL
LigandPNGBDBM50264587((R)-5-(3-(2-(2-(3-chlorophenyl)-2-hydroxyethylamin...)
Affinity DataEC50: >1.00E+3nM. Assay description: Agonist activity at human cloned adrenergic beta1 receptor expressed in CHO cells assessed as cAMP accumulation
In DepthDetails ArticlePubMed
TargetBeta-3 adrenergic receptor(Homo sapiens (Human))
Astellas Pharma
Curated by ChEMBL
LigandPNGBDBM50264587((R)-5-(3-(2-(2-(3-chlorophenyl)-2-hydroxyethylamin...)
Affinity DataEC50:  6.60nM. Assay description: Agonist activity at human cloned adrenergic beta3 receptor expressed in CHO cells assessed as cAMP accumulation
In DepthDetails ArticlePubMed