BDBM50265313 3-(4-(3-(bis(4-fluorophenyl)amino)propyl)piperazin-1-yl)-1-phenylpropyl acetate::CHEMBL498600
SMILES CC(=O)OC(CCN1CCN(CCCN(c2ccc(F)cc2)c2ccc(F)cc2)CC1)c1ccccc1
InChI Key InChIKey=BOLNQVYXWUWJJK-UHFFFAOYSA-N
Data  4 KI
  Tab Delimited (TSV)   2D SDfile   Computed 3D by Vconf -m prep SDfile
Find this compound or compounds like it in BindingDB:
Activity Spreadsheet -- Enzyme Inhibition Constant Data from BindingDB
Found 4 hits for monomerid = 50265313
TargetSodium-dependent dopamine transporter(Rattus norvegicus (rat))
National Institute On Drug Abuse-Intramural Research Program
Curated by ChEMBL
LigandPNGBDBM50265313(3-(4-(3-(bis(4-fluorophenyl)amino)propyl)piperazin...)
Affinity DataKi:  4.28nM. Assay description: Displacement of [3H]WIN-35428 from DAT in rat striatum membrane
In DepthDetails ArticlePubMed
TargetSigma non-opioid intracellular receptor 1(Cavia porcellus (Guinea pig))
National Institute On Drug Abuse-Intramural Research Program
Curated by ChEMBL
LigandPNGBDBM50265313(3-(4-(3-(bis(4-fluorophenyl)amino)propyl)piperazin...)
Affinity DataKi:  56.6nM. Assay description: Displacement of [3H](+)-pentazocine from sigma 1 receptor in guinea pig brain membrane
In DepthDetails ArticlePubMed
TargetSodium-dependent serotonin transporter(Rattus norvegicus (rat))
National Institute On Drug Abuse-Intramural Research Program
Curated by ChEMBL
LigandPNGBDBM50265313(3-(4-(3-(bis(4-fluorophenyl)amino)propyl)piperazin...)
Affinity DataKi:  204nM. Assay description: Displacement of [3H]citalopram from SERT in rat brain stem membrane
In DepthDetails ArticlePubMed
TargetTransporter(Rattus norvegicus (rat))
National Institute On Drug Abuse-Intramural Research Program
Curated by ChEMBL
LigandPNGBDBM50265313(3-(4-(3-(bis(4-fluorophenyl)amino)propyl)piperazin...)
Affinity DataKi:  990nM. Assay description: Displacement of [3H]nisoxetine from NET in rat frontal cortex membrane
In DepthDetails ArticlePubMed