BDBM50266095 CHEMBL444965::ETHANEPEROXOIC ACID::peracetic acid
SMILES CC(=O)OO
InChI Key InChIKey=KFSLWBXXFJQRDL-UHFFFAOYSA-N
Data  1 KI
PDB links: 5 PDB IDs match this monomer.
  Tab Delimited (TSV)   2D SDfile   Computed 3D by Vconf -m prep SDfile
Find this compound or compounds like it in BindingDB:
Activity Spreadsheet -- Enzyme Inhibition Constant Data from BindingDB
Found 1 hit for monomerid = 50266095
TargetTyrosine-protein phosphatase non-receptor type 1(Homo sapiens (Human))
University Of Missouri-Columbia
Curated by ChEMBL
LigandPNGBDBM50266095(CHEMBL444965 | ETHANEPEROXOIC ACID | peracetic aci...)
Affinity DataKi:  1.70E+7nM. Assay description: Inhibition of PTP1B (unknown origin)
In DepthDetails ArticlePubMed