BDBM50266667 CHEMBL4081182
SMILES CCn1nnc(n1)[C@H]1O[C@H]([C@H](O)[C@@H]1O)n1cnc2c(NCc3cccc(I)c3)nc(Cl)nc12
InChI Key InChIKey=YCFJBJJRZOIEFY-MOROJQBDSA-N
Data  1 KI
  Tab Delimited (TSV)   2D SDfile   Computed 3D by Vconf -m prep SDfile
Find this compound or compounds like it in BindingDB:
Activity Spreadsheet -- Enzyme Inhibition Constant Data from BindingDB
Found 1 hit for monomerid = 50266667
TargetAdenosine receptor A3(Rattus norvegicus)
University Of Camerino
Curated by ChEMBL
LigandPNGBDBM50266667(CHEMBL4081182)
Affinity DataKi:  2.5nM. Assay description: Displacement of [3H]NECA from recombinant rat adenosine A3 receptor expressed in CHO cell membranes after 3 hrs by microbeta scintillation counting
In DepthDetails ArticlePubMed