BDBM50266876 CHEMBL4093959
SMILES OC(=O)CCC(=O)NCCCCCCOC(=O)c1[nH]c2cc(Cl)ccc2c1-c1c(ncn1Cc1ccc(Cl)cc1)-c1ccc(F)cc1
InChI Key InChIKey=MEJMFPQUMDEAQP-UHFFFAOYSA-N
Data  2 KI
PDB links: 2 PDB IDs match this monomer.
  Tab Delimited (TSV)   2D SDfile   Computed 3D by Vconf -m prep SDfile
Find this compound or compounds like it in BindingDB:
Activity Spreadsheet -- Enzyme Inhibition Constant Data from BindingDB
Found 2 hits for monomerid = 50266876
TargetE3 ubiquitin-protein ligase Mdm2(Homo sapiens (Human))
Jagiellonian University
Curated by ChEMBL
LigandPNGBDBM50266876(CHEMBL4093959)
Affinity DataKi:  58nM. Assay description: Binding affinity to human N-terminal MDM2 (1 to 118 residues) expressed in Escherichia coli BL21 (DE3) after 15 mins in presence of 5-FAM-LTFEHYWAQLT...
TargetProtein Mdm4(Homo sapiens (Human))
Jagiellonian University
Curated by ChEMBL
LigandPNGBDBM50266876(CHEMBL4093959)
Affinity DataKi:  2.63E+4nM. Assay description: Binding affinity to human N-terminal MDMx (1 to 134 residues) expressed in Escherichia coli BL21 (DE3) after 15 mins in presence of 5-FAM-LTFEHYWAQLT...
In DepthDetails ArticlePubMed