BDBM50267615 3-(trifluoromethyl)-5-(4-((1R,2R)-2-(4-(trifluoromethyl)phenyl)cyclopropanecarbonyl)piperazin-1-ylsulfonyl)phenyl pivalate::CHEMBL488731
SMILES CC(C)(C)C(=O)Oc1cc(cc(c1)S(=O)(=O)N1CCN(CC1)C(=O)[C@@H]1C[C@H]1c1ccc(cc1)C(F)(F)F)C(F)(F)F
InChI Key InChIKey=KWOUEZYGBKYPPI-FCHUYYIVSA-N
Data  1 IC50
  Tab Delimited (TSV)   2D SDfile   Computed 3D by Vconf -m prep SDfile
Find this compound or compounds like it in BindingDB:
Activity Spreadsheet -- Enzyme Inhibition Constant Data from BindingDB
Found 1 hit for monomerid = 50267615
TargetCannabinoid receptor 1(Homo sapiens (Human))
Merck Research Laboratories
Curated by ChEMBL
LigandPNGBDBM50267615(3-(trifluoromethyl)-5-(4-((1R,2R)-2-(4-(trifluorom...)
Affinity DataIC50:  8nM. Assay description: Displacement of [3H]CP55940 from human recombinant CB1R expressed in CHO cells
In DepthDetails ArticlePubMed