BDBM50270583 CHEMBL488350::methyl 2-((5-(4-(4-(benzyloxy)phenylamino)pyrido[3,4-d]pyrimidin-6-yl)furan-2-yl)methylamino)acetate
SMILES COC(=O)CNCc1ccc(o1)-c1cc2c(Nc3ccc(OCc4ccccc4)cc3)ncnc2cn1
InChI Key InChIKey=XUHKLLVTRWGKQX-UHFFFAOYSA-N
Data  1 IC50
  Tab Delimited (TSV)   2D SDfile   Computed 3D by Vconf -m prep SDfile
Find this compound or compounds like it in BindingDB:
Activity Spreadsheet -- Enzyme Inhibition Constant Data from BindingDB
Found 1 hit for monomerid = 50270583
TargetReceptor tyrosine-protein kinase erbB-2(Homo sapiens (Human))
University Of Southern California
Curated by ChEMBL
LigandPNGBDBM50270583(CHEMBL488350 | methyl 2-((5-(4-(4-(benzyloxy)pheny...)
Affinity DataIC50:  13nM. Assay description: Inhibition of HER2 (unknown origin)
In DepthDetails ArticlePubMed