BDBM50271072 2-(2-Amino-2-oxoethyl)-3,5-dibromo-4-hydroxyphenyl(4-carbamimidamidobutyl)carbamate::CHEMBL486904
SMILES [#7]\[#6](-[#7])=[#7]\[#6]-[#6]-[#6]-[#6]-[#7]-[#6](=O)-[#8]-c1cc(Br)c(-[#8])c(Br)c1-[#6]-[#6](-[#7])=O
InChI Key InChIKey=AAAZGBHLLCPNHK-UHFFFAOYSA-N
Data  1 IC50
  Tab Delimited (TSV)   2D SDfile   Computed 3D by Vconf -m prep SDfile
Find this compound or compounds like it in BindingDB:
Activity Spreadsheet -- Enzyme Inhibition Constant Data from BindingDB
Found 1 hit for monomerid = 50271072
TargetCoagulation factor XI(Homo sapiens (Human))
Griffith University
Curated by ChEMBL
LigandPNGBDBM50271072(2-(2-Amino-2-oxoethyl)-3,5-dibromo-4-hydroxyphenyl...)
Affinity DataIC50:  2.70E+4nM. Assay description: Inhibition of factor 11a (unknown origin)
In DepthDetails ArticlePubMed