BDBM50271723 CHEMBL482728::{2-[(6,7-Dimethoxy-4-quinolyl)oxy]phenyl}(phenyl)methanone
SMILES COc1cc2nccc(Oc3ccccc3C(=O)c3ccccc3)c2cc1OC
InChI Key InChIKey=IKWYJDFTNMSTAW-UHFFFAOYSA-N
Data  2 IC50
  Tab Delimited (TSV)   2D SDfile   Computed 3D by Vconf -m prep SDfile
Find this compound or compounds like it in BindingDB:
Activity Spreadsheet -- Enzyme Inhibition Constant Data from BindingDB
Found 2 hits for monomerid = 50271723
TargetTGF-beta receptor type-1(Homo sapiens (Human))
Kirin Pharma
Curated by ChEMBL
LigandPNGBDBM50271723(CHEMBL482728 | {2-[(6,7-Dimethoxy-4-quinolyl)oxy]p...)
Affinity DataIC50:  1.60E+4nM. Assay description: Inhibition of ALK5 (unknown origin) by filter binding assay
In DepthDetails ArticlePubMed
TargetProto-oncogene tyrosine-protein kinase Src(Homo sapiens (Human))
Kirin Pharma
Curated by ChEMBL
LigandPNGBDBM50271723(CHEMBL482728 | {2-[(6,7-Dimethoxy-4-quinolyl)oxy]p...)
Affinity DataIC50:  4.50E+3nM. Assay description: Inhibition of c-Src (unknown origin)
In DepthDetails ArticlePubMed