BDBM50272106 2-(4-(methylsulfonyl)phenyl)-3-phenyl-1H-indole::CHEMBL499070
SMILES CS(=O)(=O)c1ccc(cc1)-c1[nH]c2ccccc2c1-c1ccccc1
InChI Key InChIKey=YQFNXPINIXDIAQ-UHFFFAOYSA-N
Data  2 IC50
  Tab Delimited (TSV)   2D SDfile   Computed 3D by Vconf -m prep SDfile
Find this compound or compounds like it in BindingDB:
Activity Spreadsheet -- Enzyme Inhibition Constant Data from BindingDB
Found 2 hits for monomerid = 50272106
TargetProstaglandin G/H synthase 2(Mus musculus (Mouse))TBA
LigandPNGBDBM50272106(2-(4-(methylsulfonyl)phenyl)-3-phenyl-1H-indole | ...)
Affinity DataIC50:  0.603nM. Assay description: Inhibition of COX2 in Mus musculus (mouse) peritoneal macrophage
In DepthDetails Article
TargetProstaglandin G/H synthase 2(Homo sapiens (Human))
Institute Of Technology And Science
Curated by ChEMBL
LigandPNGBDBM50272106(2-(4-(methylsulfonyl)phenyl)-3-phenyl-1H-indole | ...)
Affinity DataIC50:  0.600nM. Assay description: Inhibition of COX2 (unknown origin)
In DepthDetails ArticlePubMed