BDBM50272115 5-fluoro-2-(4-(methylsulfonyl)phenyl)-3-phenyl-1H-indole::CHEMBL525246
SMILES CS(=O)(=O)c1ccc(cc1)-c1[nH]c2ccc(F)cc2c1-c1ccccc1
InChI Key InChIKey=HCIXODIQXMVZAX-UHFFFAOYSA-N
Data  2 IC50
  Tab Delimited (TSV)   2D SDfile   Computed 3D by Vconf -m prep SDfile
Find this compound or compounds like it in BindingDB:
Activity Spreadsheet -- Enzyme Inhibition Constant Data from BindingDB
Found 2 hits for monomerid = 50272115
TargetProstaglandin G/H synthase 2(Mus musculus (Mouse))TBA
LigandPNGBDBM50272115(5-fluoro-2-(4-(methylsulfonyl)phenyl)-3-phenyl-1H-...)
Affinity DataIC50:  5nM. Assay description: Inhibition of COX2 in Mus musculus (mouse) peritoneal macrophage
In DepthDetails Article
TargetProstaglandin G/H synthase 2(Homo sapiens (Human))
Institute Of Technology And Science
Curated by ChEMBL
LigandPNGBDBM50272115(5-fluoro-2-(4-(methylsulfonyl)phenyl)-3-phenyl-1H-...)
Affinity DataIC50:  5nM. Assay description: Inhibition of COX2 (unknown origin)
In DepthDetails ArticlePubMed