BDBM50272130 5-methyl-2-(4-(methylsulfonyl)phenyl)-3-phenyl-1H-indole::CHEMBL525250
SMILES Cc1ccc2[nH]c(c(-c3ccccc3)c2c1)-c1ccc(cc1)S(C)(=O)=O
InChI Key InChIKey=VFTJNWIPDOVECS-UHFFFAOYSA-N
Data  2 IC50
  Tab Delimited (TSV)   2D SDfile   Computed 3D by Vconf -m prep SDfile
Find this compound or compounds like it in BindingDB:
Activity Spreadsheet -- Enzyme Inhibition Constant Data from BindingDB
Found 2 hits for monomerid = 50272130
TargetProstaglandin G/H synthase 2(Mus musculus (Mouse))TBA
LigandPNGBDBM50272130(5-methyl-2-(4-(methylsulfonyl)phenyl)-3-phenyl-1H-...)
Affinity DataIC50:  0.282nM. Assay description: Inhibition of COX2 in Mus musculus (mouse) peritoneal macrophage
In DepthDetails Article
TargetProstaglandin G/H synthase 2(Homo sapiens (Human))
Institute Of Technology And Science
Curated by ChEMBL
LigandPNGBDBM50272130(5-methyl-2-(4-(methylsulfonyl)phenyl)-3-phenyl-1H-...)
Affinity DataIC50:  0.280nM. Assay description: Inhibition of COX2 (unknown origin)
In DepthDetails ArticlePubMed