BDBM50272319 CHEMBL526339::Methyl [5-(6-methoxynaphthalen-2-yl)pyridin-3-yl]acetate
SMILES COC(=O)Cc1cncc(c1)-c1ccc2cc(OC)ccc2c1
InChI Key InChIKey=NJYSPTKLOLAHQY-UHFFFAOYSA-N
Data  2 IC50
  Tab Delimited (TSV)   2D SDfile   Computed 3D by Vconf -m prep SDfile
Find this compound or compounds like it in BindingDB:
Activity Spreadsheet -- Enzyme Inhibition Constant Data from BindingDB
Found 2 hits for monomerid = 50272319
TargetCytochrome P450 11B1, mitochondrial(Homo sapiens (Human))
Saarland University
Curated by ChEMBL
LigandPNGBDBM50272319(CHEMBL526339 | Methyl [5-(6-methoxynaphthalen-2-yl...)
Affinity DataIC50:  199nM. Assay description: Inhibition of human CYP11B1 expressed in hamster V79 MZh cells
In DepthDetails ArticlePubMed
TargetCytochrome P450 11B2, mitochondrial(Homo sapiens (Human))
Saarland University
Curated by ChEMBL
LigandPNGBDBM50272319(CHEMBL526339 | Methyl [5-(6-methoxynaphthalen-2-yl...)
Affinity DataIC50:  6.90nM. Assay description: Inhibition of human CYP11B2 expressed in hamster V79 MZh cells
In DepthDetails ArticlePubMed