BDBM50277555 Benzyl 5-(4-chlorophenyl)-1-(2,4-dichlorophenyl)-4-methyl-1H-pyrazole-3-carbonyl carbamate::CHEMBL484416
SMILES Cc1c(nn(c1-c1ccc(Cl)cc1)-c1ccc(Cl)cc1Cl)C(=O)NC(=O)OCc1ccccc1
InChI Key InChIKey=SMQCNAHRMYUWNS-UHFFFAOYSA-N
Data  1 IC50
  Tab Delimited (TSV)   2D SDfile   Computed 3D by Vconf -m prep SDfile
Find this compound or compounds like it in BindingDB:
Activity Spreadsheet -- Enzyme Inhibition Constant Data from BindingDB
Found 1 hit for monomerid = 50277555
TargetCannabinoid receptor 1(Rattus norvegicus (rat))
Green Cross
Curated by ChEMBL
LigandPNGBDBM50277555(Benzyl 5-(4-chlorophenyl)-1-(2,4-dichlorophenyl)-4...)
Affinity DataIC50:  17.8nM. Assay description: Displacement of [3H]CP55940 from CB1R in Sprague-Dawley rat cerebellar membrane
In DepthDetails ArticlePubMed