BDBM50278777 (R)-methyl 4-(1-amino-2-(2,4,5-trifluorophenyl)ethyl)benzoate::CHEMBL509672
SMILES COC(=O)c1ccc(cc1)[C@H](N)Cc1cc(F)c(F)cc1F
InChI Key InChIKey=YGYBYQYARMLNPQ-OAHLLOKOSA-N
Data  1 IC50
  Tab Delimited (TSV)   2D SDfile   Computed 3D by Vconf -m prep SDfile
Find this compound or compounds like it in BindingDB:
Activity Spreadsheet -- Enzyme Inhibition Constant Data from BindingDB
Found 1 hit for monomerid = 50278777
TargetDipeptidyl peptidase 4(Homo sapiens (Human))
Pfizer
Curated by ChEMBL
LigandPNGBDBM50278777((R)-methyl 4-(1-amino-2-(2,4,5-trifluorophenyl)eth...)
Affinity DataIC50:  1.42E+3nM. Assay description: Inhibition of human DPP4
In DepthDetails ArticlePubMed