BDBM50280005 3-(Benzoyl-carboxymethyl-amino)-4,6-dichloro-1H-indole-2-carboxylic acid::CHEMBL341813
SMILES OC(=O)CN(C(=O)c1ccccc1)c1c([nH]c2cc(Cl)cc(Cl)c12)C(O)=O
InChI Key InChIKey=JTSBJUUGXLSFDP-UHFFFAOYSA-N
Data  1 IC50
  Tab Delimited (TSV)   2D SDfile   Computed 3D by Vconf -m prep SDfile
Find this compound or compounds like it in BindingDB:
Activity Spreadsheet -- Enzyme Inhibition Constant Data from BindingDB
Found 1 hit for monomerid = 50280005
LigandPNGBDBM50280005(3-(Benzoyl-carboxymethyl-amino)-4,6-dichloro-1H-in...)
Affinity DataIC50:  400nM. Assay description: Ability of compound to compete with [3H]-glycine for the strychnine-insensitive NMDA receptor glycine binding sites on rat cortical and hippocampus
In DepthDetails Article