BDBM50280257 CHEMBL4171659
SMILES NS(=O)(=O)c1ccc(NC(=O)Cn2ccc(=O)[nH]c2=O)cc1
InChI Key InChIKey=FIFNUJTXJIFDBS-UHFFFAOYSA-N
Data  4 KI
PDB links: 1 PDB ID matches this monomer.
  Tab Delimited (TSV)   2D SDfile   Computed 3D by Vconf -m prep SDfile
Find this compound or compounds like it in BindingDB:
Activity Spreadsheet -- Enzyme Inhibition Constant Data from BindingDB
Found 4 hits for monomerid = 50280257
TargetCarbonic anhydrase 2(Homo sapiens (Human))
University Of Florence
Curated by ChEMBL
LigandPNGBDBM50280257(CHEMBL4171659)
Affinity DataKi:  18nM. Assay description: Inhibition of human carbonic anhydrase 2 incubated for 15 mins by stopped flow CO2 hydrase assay
TargetCarbonic anhydrase 9(Homo sapiens (Human))
University Of Florence
Curated by ChEMBL
LigandPNGBDBM50280257(CHEMBL4171659)
Affinity DataKi:  26nM. Assay description: Inhibition of human carbonic anhydrase 9 incubated for 15 mins by stopped flow CO2 hydrase assay
In DepthDetails ArticlePubMed
TargetCarbonic anhydrase 4(Homo sapiens (Human))
University Of Florence
Curated by ChEMBL
LigandPNGBDBM50280257(CHEMBL4171659)
Affinity DataKi:  470nM. Assay description: Inhibition of human placental cytochrome P450 19A1 androstenedione
In DepthDetails ArticlePubMed
TargetCarbonic anhydrase 1(Homo sapiens (Human))
University Of Florence
Curated by ChEMBL
LigandPNGBDBM50280257(CHEMBL4171659)
Affinity DataKi:  646nM. Assay description: Inhibition of human carbonic anhydrase 1 incubated for 15 mins by stopped flow CO2 hydrase assay
In DepthDetails ArticlePubMed