BDBM50281095 CHEMBL405188::N-[3-(1-benzothien-2-yl)cyclobutyl]-N-hydroxyurea
SMILES NC(=O)N(O)[C@H]1C[C@@H](C1)c1cc2ccccc2s1
InChI Key InChIKey=HZUKONWCAIZARL-MGCOHNPYSA-N
Data  1 IC50
  Tab Delimited (TSV)   2D SDfile   Computed 3D by Vconf -m prep SDfile
Find this compound or compounds like it in BindingDB:
Activity Spreadsheet -- Enzyme Inhibition Constant Data from BindingDB
Found 1 hit for monomerid = 50281095
TargetPolyunsaturated fatty acid 5-lipoxygenase(Homo sapiens (Human))
TBA
Curated by ChEMBL
LigandPNGBDBM50281095(CHEMBL405188 | N-[3-(1-benzothien-2-yl)cyclobutyl]...)
Affinity DataIC50:  380nM. Assay description: The compound was tested in vitro for inhibition against 5-lipoxygenase in intact human neutrophils
In DepthDetails Article