BDBM50282248 CHEMBL287065::Lithium; 2-[5-(2-butyl-5-hydroxymethyl-imidazol-1-ylmethyl)-indol-1-yl]-benzoate
SMILES CCCCc1ncc(CO)n1Cc1ccc2n(ccc2c1)-c1ccccc1C([O-])=O
InChI Key InChIKey=OYCLBLHPLNHCNE-UHFFFAOYSA-M
Data  1 KI
  Tab Delimited (TSV)   2D SDfile   Computed 3D by Vconf -m prep SDfile
Find this compound or compounds like it in BindingDB:
Activity Spreadsheet -- Enzyme Inhibition Constant Data from BindingDB
Found 1 hit for monomerid = 50282248
LigandPNGBDBM50282248(CHEMBL287065 | Lithium; 2-[5-(2-butyl-5-hydroxymet...)
Affinity DataKi:  760nM. Assay description: Binding affinity for Angiotensin II receptor, type 1 determined using [125I]- labeled [Sar1,Ile8] angiotensin II in rat adrenocortical membranes
In DepthDetails Article