BDBM50283577 CHEMBL88094::Sodium; (3-carboxy-5-phosphono-phenoxy)-acetate
SMILES OP(O)(=O)c1cc(OCC([O-])=O)cc(c1)C([O-])=O
InChI Key InChIKey=HYEPUIZZZBXOPS-UHFFFAOYSA-L
Data  1 IC50
  Tab Delimited (TSV)   2D SDfile   Computed 3D by Vconf -m prep SDfile
Find this compound or compounds like it in BindingDB:
Activity Spreadsheet -- Enzyme Inhibition Constant Data from BindingDB
Found 1 hit for monomerid = 50283577
Target3-phosphoshikimate 1-carboxyvinyltransferase(Escherichia coli (strain K12))
TBA
Curated by ChEMBL
LigandPNGBDBM50283577(CHEMBL88094 | Sodium; (3-carboxy-5-phosphono-pheno...)
Affinity DataIC50:  1.00E+7nM. Assay description: Inhibition of Escherichia coli EPSP synthase
In DepthDetails Article