BDBM50285209 2-(4-Fluoro-phenyl)-3-(4-methanesulfinyl-phenyl)-thiophene::CHEMBL63283
SMILES CS(=O)c1ccc(cc1)-c1ccsc1-c1ccc(F)cc1
InChI Key InChIKey=UIHLRZBEUBLOBS-UHFFFAOYSA-N
Data  2 IC50
  Tab Delimited (TSV)   2D SDfile   Computed 3D by Vconf -m prep SDfile
Find this compound or compounds like it in BindingDB:
Activity Spreadsheet -- Enzyme Inhibition Constant Data from BindingDB
Found 2 hits for monomerid = 50285209
TargetProstaglandin G/H synthase 2(Homo sapiens (Human))
TBA
Curated by ChEMBL
LigandPNGBDBM50285209(2-(4-Fluoro-phenyl)-3-(4-methanesulfinyl-phenyl)-t...)
Affinity DataIC50: >3.00E+4nM. Assay description: Inhibitory activity against human COX-2 expressed in baculovirus infected Sf9 cells
In DepthDetails Article
TargetProstaglandin G/H synthase 1(Homo sapiens (Human))
TBA
Curated by ChEMBL
LigandPNGBDBM50285209(2-(4-Fluoro-phenyl)-3-(4-methanesulfinyl-phenyl)-t...)
Affinity DataIC50:  1.50E+4nM. Assay description: Inhibitory activity against human COX-1 expressed in baculovirus infected Sf9 cells
In DepthDetails Article