BDBM50286046 3-(4-Fluoro-phenyl)-4-(4-methanesulfonyl-phenyl)-thiophene::CHEMBL319306
SMILES CS(=O)(=O)c1ccc(cc1)-c1cscc1-c1ccc(F)cc1
InChI Key InChIKey=APTPOHBDWBGOML-UHFFFAOYSA-N
Data  6 IC50
  Tab Delimited (TSV)   2D SDfile   Computed 3D by Vconf -m prep SDfile
Find this compound or compounds like it in BindingDB:
Activity Spreadsheet -- Enzyme Inhibition Constant Data from BindingDB
Found 6 hits for monomerid = 50286046
TargetProstaglandin G/H synthase 1(Homo sapiens (Human))
TBA
Curated by ChEMBL
LigandPNGBDBM50286046(3-(4-Fluoro-phenyl)-4-(4-methanesulfonyl-phenyl)-t...)
Affinity DataIC50: >1.00E+6nM. Assay description: Inhibitory activity against human recombinant Prostaglandin G/H synthase 1
In DepthDetails Article
TargetProstaglandin G/H synthase 1(Homo sapiens (Human))
TBA
Curated by ChEMBL
LigandPNGBDBM50286046(3-(4-Fluoro-phenyl)-4-(4-methanesulfonyl-phenyl)-t...)
Affinity DataIC50: >1.00E+5nM. Assay description: Inhibitory activity of the compound against human recombinant Prostaglandin G/H synthase 1 expressed in microsomes taken from baculovirus infected Sf...
In DepthDetails Article
TargetProstaglandin G/H synthase 2(Homo sapiens (Human))
TBA
Curated by ChEMBL
LigandPNGBDBM50286046(3-(4-Fluoro-phenyl)-4-(4-methanesulfonyl-phenyl)-t...)
Affinity DataIC50:  8.00E+3nM. Assay description: Compound was evaluated for inhibitory activity against human Prostaglandin G/H synthase 2
In DepthDetails Article
TargetProstaglandin G/H synthase 2(Homo sapiens (Human))
TBA
Curated by ChEMBL
LigandPNGBDBM50286046(3-(4-Fluoro-phenyl)-4-(4-methanesulfonyl-phenyl)-t...)
Affinity DataIC50:  80nM. Assay description: Inhibitory activity against human recombinant Prostaglandin G/H synthase 2
In DepthDetails Article
TargetProstaglandin G/H synthase 2(Homo sapiens (Human))
TBA
Curated by ChEMBL
LigandPNGBDBM50286046(3-(4-Fluoro-phenyl)-4-(4-methanesulfonyl-phenyl)-t...)
Affinity DataIC50:  470nM. Assay description: Inhibitory activity of the compound against human recombinant Prostaglandin G/H synthase 2 expressed in microsomes taken from baculovirus infected Sf...
In DepthDetails Article
TargetProstaglandin G/H synthase 1(Ovis aries (Sheep))
TBA
Curated by ChEMBL
LigandPNGBDBM50286046(3-(4-Fluoro-phenyl)-4-(4-methanesulfonyl-phenyl)-t...)
Affinity DataIC50:  6.74E+5nM. Assay description: Compound was evaluated for inhibitory activity against ovine Prostaglandin G/H synthase 1
In DepthDetails Article