BDBM50286664 CHEMBL155975::N-hydroxy-N'-[3-methoxy-5-(5-(3,4,5-trimethoxyphenyl)tetrathydrofuran-2-yl)-2-propoxyphenyl]-N-cyclohexyl-N-hydroxyurea
SMILES CCCOc1c(NC(=O)N(O)C2CCCCC2)cc(cc1OC)C1CCC(O1)c1cc(OC)c(OC)c(OC)c1
InChI Key InChIKey=QCHIKUDBAALGIC-UHFFFAOYSA-N
Data  3 IC50
  Tab Delimited (TSV)   2D SDfile   Computed 3D by Vconf -m prep SDfile
Find this compound or compounds like it in BindingDB:
Activity Spreadsheet -- Enzyme Inhibition Constant Data from BindingDB
Found 3 hits for monomerid = 50286664
TargetPlatelet-activating factor receptor(Homo sapiens (Human))
TBA
Curated by ChEMBL
LigandPNGBDBM50286664(CHEMBL155975 | N-hydroxy-N'-[3-methoxy-5-(5-(3,4,5...)
Affinity DataIC50:  1.00E+3nM. Assay description: In vitro affinity for human PAF receptor on platelet membranes using [3H]-PAF displacement.
In DepthDetails Article
TargetPlatelet-activating factor receptor(Homo sapiens (Human))
TBA
Curated by ChEMBL
LigandPNGBDBM50286664(CHEMBL155975 | N-hydroxy-N'-[3-methoxy-5-(5-(3,4,5...)
Affinity DataIC50:  1.00E+3nM. Assay description: In vitro affinity for human PAF receptor on platelet membranes using [3H]-PAF displacement.
In DepthDetails Article
TargetPolyunsaturated fatty acid 5-lipoxygenase(Rattus norvegicus)
TBA
Curated by ChEMBL
LigandPNGBDBM50286664(CHEMBL155975 | N-hydroxy-N'-[3-methoxy-5-(5-(3,4,5...)
Affinity DataIC50:  2.54E+3nM. Assay description: In vitro inhibition of 5-lipoxygenase in RBL-2H3 (Rat basophilic leukaemia) cells.
In DepthDetails Article