BDBM50287547 1-Methyl-5-(2-nitro-phenyl)-3-propyl-1,6-dihydro-pyrazolo[4,3-d]pyrimidin-7-one::1-methyl-5-(2-nitrophenyl)-3-propyl-1H-pyrazolo[4,3-d]pyrimidin-7(6H)-one::CHEMBL52072
SMILES CCCc1nn(C)c2c1nc([nH]c2=O)-c1ccccc1[N+]([O-])=O
InChI Key InChIKey=YCUPRYDDWADPAJ-UHFFFAOYSA-N
Data  3 IC50
  Tab Delimited (TSV)   2D SDfile   Computed 3D by Vconf -m prep SDfile
Find this compound or compounds like it in BindingDB:
Activity Spreadsheet -- Enzyme Inhibition Constant Data from BindingDB
Found 3 hits for monomerid = 50287547
TargetcGMP-specific 3',5'-cyclic phosphodiesterase(Homo sapiens (Human))
TBA
Curated by ChEMBL
LigandPNGBDBM50287547(1-Methyl-5-(2-nitro-phenyl)-3-propyl-1,6-dihydro-p...)
Affinity DataIC50:  4.40E+3nM. Assay description: Inhibition of Phosphodiesterase 5 from rabbit platelets
In DepthDetails Article
TargetcGMP-inhibited 3',5'-cyclic phosphodiesterase 3A/3B(Homo sapiens (Human))
TBA
Curated by ChEMBL
LigandPNGBDBM50287547(1-Methyl-5-(2-nitro-phenyl)-3-propyl-1,6-dihydro-p...)
Affinity DataIC50: >1.00E+5nM. Assay description: Inhibition of Phosphodiesterase 3 from rabbit platelets
In DepthDetails Article
TargetcGMP-specific 3',5'-cyclic phosphodiesterase(Homo sapiens (Human))
TBA
Curated by ChEMBL
LigandPNGBDBM50287547(1-Methyl-5-(2-nitro-phenyl)-3-propyl-1,6-dihydro-p...)
Affinity DataIC50:  4.37E+3nM. Assay description: Inhibition of PDE5
In DepthDetails ArticlePubMed