BDBM50287711 [methyl({[(phosphonatooxy)phosphinato]oxy}acetyl)amino]acetate
SMILES CN(CC([O-])=O)C(=O)COP([O-])(=O)OP([O-])([O-])=O
InChI Key InChIKey=KFTRLZCNVAMIQX-UHFFFAOYSA-J
Data  1 IC50
  Tab Delimited (TSV)   2D SDfile   Computed 3D by Vconf -m prep SDfile
Find this compound or compounds like it in BindingDB:
Activity Spreadsheet -- Enzyme Inhibition Constant Data from BindingDB
Found 1 hit for monomerid = 50287711
TargetDiphosphomevalonate decarboxylase(Homo sapiens (Human))
TBA
Curated by ChEMBL
LigandPNGBDBM50287711([methyl({[(phosphonatooxy)phosphinato]oxy}acetyl)a...)
Affinity DataIC50:  300nM. Assay description: Compound was evaluated for its inhibitory activity against MevPP decarboxylase
In DepthDetails Article